Target
Androgen receptor
Ligand
BDBM50073060
Substrate
Meas. Tech.
ChEMBL_36114 (CHEMBL648079)
IC50
0.05±n/a nM
Citation
 Hamann, LGMani, NSDavis, RLWang, XNMarschke, KBJones, TK Discovery of a potent, orally active, nonsteroidal androgen receptor agonist: 4-ethyl-1,2,3,4-tetrahydro-6- (trifluoromethyl)-8-pyridono[5,6-g]- quinoline (LG121071). J Med Chem 42:210-2 (1999)  
Target
Name:
Androgen receptor
Synonyms:
ANDR_HUMAN Androgen Receptor Androgen receptor/Baculoviral IAP repeat-containing protein 2 Dihydrotestosterone receptor Nuclear receptor subfamily 3 group C member 4
Type:
Receptor
Mol. Mass.:
99185.27
Organism:
Homo sapiens (Human)
Description:
CHO cells were stably transfected with human AR gene.
Residue:
920
  
Inhibitor
Name:
BDBM50073060
Synonyms:
(9R,10S,11S,13S,17S)-9-Fluoro-11,17-dihydroxy-10,13,17-trimethyl-1,2,6,7,8,9,10,11,12,13,14,15,16,17-tetradecahydro-cyclopenta[a]phenanthren-3-one | CHEMBL302870
Type:
Small organic molecule
Emp. Form.:
C20H29FO3
Mol. Mass.:
336.4409
SMILES:
C[C@]1(O)CCC2C3CCC4=CC(=O)CC[C@]4(C)[C@@]3(F)[C@@H](O)C[C@]12C
: