Target
Interstitial collagenase
Ligand
BDBM50082550
Substrate
Meas. Tech.
ChEMBL_105952 (CHEMBL715366)
IC50
1±n/a nM
Citation
 Almstead, NGBradley, RSPikul, SDe, BNatchus, MGTaiwo, YOGu, FWilliams, LEHynd, BAJanusz, MJDunaway, CMMieling, GE Design, synthesis, and biological evaluation of potent thiazine- and thiazepine-based matrix metalloproteinase inhibitors. J Med Chem 42:4547-62 (1999)  
Target
Name:
Interstitial collagenase
Synonyms:
CLG MMP1 Matrix metalloproteinase-1 | Matrix metalloproteinase-1 (MMP-1)
Type:
Enzyme
Mol. Mass.:
54010.26
Organism:
Homo sapiens (Human)
Description:
P03956
Residue:
469
  
Inhibitor
Name:
BDBM50082550
Synonyms:
(S)-4-(4-Methoxy-benzenesulfonyl)-6-methoxymethoxy-2,2-dimethyl-[1,4]thiazepane-3-carboxylic acid hydroxyamide | CHEMBL337594
Type:
Small organic molecule
Emp. Form.:
C17H26N2O7S2
Mol. Mass.:
434.528
SMILES:
COCOC1CSC(C)(C)[C@@H](N(C1)S(=O)(=O)c1ccc(OC)cc1)C(=O)NO
: