Target
Interstitial collagenase
Ligand
BDBM50082534
Substrate
Meas. Tech.
ChEMBL_105952 (CHEMBL715366)
IC50
1±n/a nM
Citation
 Almstead, NGBradley, RSPikul, SDe, BNatchus, MGTaiwo, YOGu, FWilliams, LEHynd, BAJanusz, MJDunaway, CMMieling, GE Design, synthesis, and biological evaluation of potent thiazine- and thiazepine-based matrix metalloproteinase inhibitors. J Med Chem 42:4547-62 (1999)  
Target
Name:
Interstitial collagenase
Synonyms:
CLG MMP1 Matrix metalloproteinase-1 | Matrix metalloproteinase-1 (MMP-1)
Type:
Enzyme
Mol. Mass.:
54010.26
Organism:
Homo sapiens (Human)
Description:
P03956
Residue:
469
  
Inhibitor
Name:
BDBM50082534
Synonyms:
(S)-2,2-Dimethyl-4-(5-pyridin-2-yl-thiophene-2-sulfonyl)-[1,4]thiazepane-3-carboxylic acid hydroxyamide | CHEMBL344633
Type:
Small organic molecule
Emp. Form.:
C17H21N3O4S3
Mol. Mass.:
427.561
SMILES:
CC1(C)SCCCN([C@H]1C(=O)NO)S(=O)(=O)c1ccc(s1)-c1ccccn1
: