Target
C-C chemokine receptor type 1
Ligand
BDBM50082716
Substrate
Meas. Tech.
ChEMBL_41751 (CHEMBL651702)
Ki
53±n/a nM
Citation
 Ng, HPMay, KBauman, JGGhannam, AIslam, ILiang, MHoruk, RHesselgesser, JSnider, RMPerez, HDMorrissey, MM Discovery of novel non-peptide CCR1 receptor antagonists. J Med Chem 42:4680-94 (1999)  
Target
Name:
C-C chemokine receptor type 1
Synonyms:
C-C CKR-1 CC-CKR-1 CCR1 CD_antigen=CD191 CMKR1 LD78 receptor Macrophage inflammatory protein 1-alpha receptor SCYAR1
Type:
Enzyme
Mol. Mass.:
41180.69
Organism:
Homo sapiens (Human)
Description:
P32246
Residue:
355
  
Inhibitor
Name:
BDBM50082716
Synonyms:
5-[4-(4-Chloro-phenyl)-4-hydroxy-piperidin-1-yl]-2-cyano-2-phenyl-pentanoic acid methyl ester | CHEMBL343680
Type:
Small organic molecule
Emp. Form.:
C24H27ClN2O3
Mol. Mass.:
426.936
SMILES:
COC(=O)C(CCCN1CCC(O)(CC1)c1ccc(Cl)cc1)(C#N)c1ccccc1
: