Target
C-C chemokine receptor type 1
Ligand
BDBM50082730
Substrate
Meas. Tech.
ChEMBL_41751 (CHEMBL651702)
Ki
116±n/a nM
Citation
 Ng, HPMay, KBauman, JGGhannam, AIslam, ILiang, MHoruk, RHesselgesser, JSnider, RMPerez, HDMorrissey, MM Discovery of novel non-peptide CCR1 receptor antagonists. J Med Chem 42:4680-94 (1999)  
Target
Name:
C-C chemokine receptor type 1
Synonyms:
C-C CKR-1 CC-CKR-1 CCR1 CD_antigen=CD191 CMKR1 LD78 receptor Macrophage inflammatory protein 1-alpha receptor SCYAR1
Type:
Enzyme
Mol. Mass.:
41180.69
Organism:
Homo sapiens (Human)
Description:
P32246
Residue:
355
  
Inhibitor
Name:
BDBM50082730
Synonyms:
4-(4-Chloro-phenyl)-1-(4,4-diphenyl-butyl)-4-hydroxy-piperidinium; iodide | CHEMBL142004
Type:
Small organic molecule
Emp. Form.:
C27H31ClNO
Mol. Mass.:
420.994
SMILES:
OC1(CC[NH+](CCCC(c2ccccc2)c2ccccc2)CC1)c1ccc(Cl)cc1
: