Target
5-hydroxytryptamine receptor 1A
Ligand
BDBM50083272
Substrate
Meas. Tech.
ChEMBL_1432 (CHEMBL616306)
Ki
8.5±n/a nM
Citation
 Abou-Gharbia, MAChilders, WEFletcher, HMcGaughey, GPatel, UWebb, MBYardley, JAndree, TBoast, CKucharik, RJMarquis, KMorris, HScerni, RMoyer, JA Synthesis and SAR of adatanserin: novel adamantyl aryl- and heteroarylpiperazines with dual serotonin 5-HT(1A) and 5-HT(2) activity as potential anxiolytic and antidepressant agents. J Med Chem 42:5077-94 (2000)  
Target
Name:
5-hydroxytryptamine receptor 1A
Synonyms:
5-HT-1A 5-HT1A 5-hydroxytryptamine receptor 1A (5HT1A) 5ht1a Htr1a Serotonin 1a (5-HT1a) receptor/Adrenergic receptor alpha-1 | Serotonin receptor 1A
Type:
G Protein-Coupled Receptor (GPCR)
Mol. Mass.:
46445.29
Organism:
Rattus norvegicus (rat)
Description:
Binding assays were performed using rat hippocampal membranes.
Residue:
422
  
Inhibitor
Name:
BDBM50083272
Synonyms:
Adamantane-1-carboxylic acid 2-(4-pyrimidin-2-yl-piperazin-1-yl)-ethyl ester; Dihydrochloride | CHEMBL540865
Type:
Small organic molecule
Emp. Form.:
C21H30N4O2
Mol. Mass.:
370.4885
SMILES:
O=C(OCCN1CCN(CC1)c1ncccn1)C12C[C@H]3C[C@H](C[C@H](C3)C1)C2
: