Target
D(2) dopamine receptor
Ligand
BDBM50083278
Substrate
Meas. Tech.
ChEMBL_63032 (CHEMBL678335)
Ki
129±n/a nM
Citation
 Abou-Gharbia, MAChilders, WEFletcher, HMcGaughey, GPatel, UWebb, MBYardley, JAndree, TBoast, CKucharik, RJMarquis, KMorris, HScerni, RMoyer, JA Synthesis and SAR of adatanserin: novel adamantyl aryl- and heteroarylpiperazines with dual serotonin 5-HT(1A) and 5-HT(2) activity as potential anxiolytic and antidepressant agents. J Med Chem 42:5077-94 (2000)  
Target
Name:
D(2) dopamine receptor
Synonyms:
DOPAMINE D2 DOPAMINE D2 Short Dopamine D2 receptor Drd2
Type:
G Protein-Coupled Receptor (GPCR)
Mol. Mass.:
50931.60
Organism:
Rattus norvegicus (rat)
Description:
P61169
Residue:
444
  
Inhibitor
Name:
BDBM50083278
Synonyms:
Adamantane-1-carboxylic acid {2-[4-(2-methoxy-phenyl)-piperazin-1-yl]-ethyl}-amide; Dihydrochloride | CHEMBL553497
Type:
Small organic molecule
Emp. Form.:
C23H32ClN3O
Mol. Mass.:
401.973
SMILES:
Clc1cccc(c1)N1CCN(CCNC(=O)C23C[C@H]4C[C@H](C[C@H](C4)C2)C3)CC1
: