Target
5-hydroxytryptamine receptor 1A
Ligand
BDBM50083302
Substrate
Meas. Tech.
ChEMBL_1432 (CHEMBL616306)
Ki
19±n/a nM
Citation
 Abou-Gharbia, MAChilders, WEFletcher, HMcGaughey, GPatel, UWebb, MBYardley, JAndree, TBoast, CKucharik, RJMarquis, KMorris, HScerni, RMoyer, JA Synthesis and SAR of adatanserin: novel adamantyl aryl- and heteroarylpiperazines with dual serotonin 5-HT(1A) and 5-HT(2) activity as potential anxiolytic and antidepressant agents. J Med Chem 42:5077-94 (2000)  
Target
Name:
5-hydroxytryptamine receptor 1A
Synonyms:
5-HT-1A 5-HT1A 5-hydroxytryptamine receptor 1A (5HT1A) 5ht1a Htr1a Serotonin 1a (5-HT1a) receptor/Adrenergic receptor alpha-1 | Serotonin receptor 1A
Type:
G Protein-Coupled Receptor (GPCR)
Mol. Mass.:
46445.29
Organism:
Rattus norvegicus (rat)
Description:
Binding assays were performed using rat hippocampal membranes.
Residue:
422
  
Inhibitor
Name:
BDBM50083302
Synonyms:
Adamantane-1-carboxylic acid {3-[4-(3-chloro-phenyl)-piperazin-1-yl]-propyl}-amide; Dihydrochloride | CHEMBL556583
Type:
Small organic molecule
Emp. Form.:
C24H34ClN3O
Mol. Mass.:
415.999
SMILES:
Clc1cccc(c1)N1CCN(CCCNC(=O)C23C[C@H]4C[C@H](C[C@H](C4)C2)C3)CC1
: