Target
Neuraminidase
Ligand
BDBM50083327
Substrate
Meas. Tech.
ChEMBL_144589 (CHEMBL749506)
Ki
0.65±n/a nM
Citation
 Wall, IDLeach, ARSalt, DWFord, MGEssex, JW Binding constants of neuraminidase inhibitors: An investigation of the linear interaction energy method. J Med Chem 42:5142-52 (2000)  
Target
Name:
Neuraminidase
Synonyms:
Influenza A Virus Neuraminidase NRAM_I34A1 Neuraminidase A
Type:
Enzyme
Mol. Mass.:
50124.14
Organism:
Influenza A virus (A/Puerto Rico/8/34/Mount Sinai(H1N1))
Description:
P03468
Residue:
454
  
Inhibitor
Name:
BDBM50083327
Synonyms:
3-Acetylamino-6-dihydroxymethyl-4-guanidino-3,4-dihydro-2H-pyran-2-carboxylic acid phenethyl-propyl-amide | CHEMBL147283
Type:
Small organic molecule
Emp. Form.:
C21H31N5O5
Mol. Mass.:
433.5013
SMILES:
[#6]-[#6]-[#6]-[#7](-[#6]-[#6]-c1ccccc1)-[#6](=O)-[#6@@H]-1-[#8]-[#6](=[#6]-[#6@H](\[#7]=[#6](\[#7])-[#7])-[#6@H]-1-[#7]-[#6](-[#6])=O)-[#6](-[#8])-[#8]
: