Target
D(2) dopamine receptor
Ligand
BDBM50083341
Substrate
Meas. Tech.
ChEMBL_60058 (CHEMBL671372)
Ki
287±n/a nM
Citation
 Belliotti, TRWustrow, DJBrink, WAZoski, KTShih, YHWhetzel, SZGeorgic, LMCorbin, AEAkunne, HCHeffner, TGPugsley, TAWise, LD A series of 6- and 7-piperazinyl- and -piperidinylmethylbenzoxazinones with dopamine D4 antagonist activity: discovery of a potential atypical antipsychotic agent. J Med Chem 42:5181-7 (2000)  
Target
Name:
D(2) dopamine receptor
Synonyms:
D(2) dopamine receptor DOPAMINE D2 Long DRD2 Dopamine D2 receptor Dopamine D2 receptor (D2R) Dopamine2-like | d2
Type:
Cell-surface receptors
Mol. Mass.:
50647.10
Organism:
Homo sapiens (Human)
Description:
P14416
Residue:
443
  
Inhibitor
Name:
BDBM50083341
Synonyms:
7-(4-p-Tolyl-piperidin-1-ylmethyl)-4H-benzo[1,4]oxazin-3-one | CHEMBL151286
Type:
Small organic molecule
Emp. Form.:
C21H24N2O2
Mol. Mass.:
336.4275
SMILES:
Cc1ccc(cc1)C1CCN(Cc2ccc3NC(=O)COc3c2)CC1
: