Target
Corticotropin-releasing factor receptor 1
Ligand
BDBM50074420
Substrate
Meas. Tech.
ChEMBL_51131 (CHEMBL664192)
Ki
29±n/a nM
Citation
 Hodge, CNAldrich, PEWasserman, ZRFernandez, CHNemeth, GAArvanitis, ACheeseman, RSChorvat, RJCiganek, EChristos, TEGilligan, PJKrenitsky, PScholfield, EStrucely, P Corticotropin-releasing hormone receptor antagonists: framework design and synthesis guided by ligand conformational studies. J Med Chem 42:819-32 (1999)  
Target
Name:
Corticotropin-releasing factor receptor 1
Synonyms:
CRF-R CRFR1_RAT Corticotropin releasing factor receptor Corticotropin-releasing Factor Receptor 1 Crhr | Crhr1
Type:
G Protein-Coupled Receptor (GPCR)
Mol. Mass.:
47870.75
Organism:
Rattus norvegicus (rat)
Description:
Receptor binding assays were performed using rat cortex homogenate.
Residue:
415
  
Inhibitor
Name:
BDBM50074420
Synonyms:
1-(2-Bromo-4,6-dimethoxy-phenyl)-4,6-dimethyl-1H-pyrrolo[2,3-b]pyridine-3-carbonitrile | CHEMBL169838
Type:
Small organic molecule
Emp. Form.:
C18H16BrN3O2
Mol. Mass.:
386.243
SMILES:
COc1cc(Br)c(c(OC)c1)-n1cc(C#N)c2c(C)cc(C)nc12
: