Target
Corticotropin-releasing factor receptor 1
Ligand
BDBM50074430
Substrate
Meas. Tech.
ChEMBL_51131 (CHEMBL664192)
Ki
67±n/a nM
Citation
 Hodge, CNAldrich, PEWasserman, ZRFernandez, CHNemeth, GAArvanitis, ACheeseman, RSChorvat, RJCiganek, EChristos, TEGilligan, PJKrenitsky, PScholfield, EStrucely, P Corticotropin-releasing hormone receptor antagonists: framework design and synthesis guided by ligand conformational studies. J Med Chem 42:819-32 (1999)  
Target
Name:
Corticotropin-releasing factor receptor 1
Synonyms:
CRF-R CRFR1_RAT Corticotropin releasing factor receptor Corticotropin-releasing Factor Receptor 1 Crhr | Crhr1
Type:
G Protein-Coupled Receptor (GPCR)
Mol. Mass.:
47870.75
Organism:
Rattus norvegicus (rat)
Description:
Receptor binding assays were performed using rat cortex homogenate.
Residue:
415
  
Inhibitor
Name:
BDBM50074430
Synonyms:
1-(2-Bromo-4-isopropyl-phenyl)-4-chloro-6-methyl-1H-pyrrolo[2,3-b]pyridine | CHEMBL353774
Type:
Small organic molecule
Emp. Form.:
C17H16BrClN2
Mol. Mass.:
363.679
SMILES:
CC(C)c1ccc(c(Br)c1)-n1ccc2c(Cl)cc(C)nc12
: