Target
Myosin light chain kinase, smooth muscle
Ligand
BDBM50074651
Substrate
Meas. Tech.
ChEMBL_140967 (CHEMBL745132)
IC50
310±n/a nM
Citation
 Lukas, TJMirzoeva, SSlomczynska, UWatterson, DM Identification of novel classes of protein kinase inhibitors using combinatorial peptide chemistry based on functional genomics knowledge. J Med Chem 42:910-9 (1999)  
Target
Name:
Myosin light chain kinase, smooth muscle
Synonyms:
MLCK Mylk Telokin
Type:
Enzyme
Mol. Mass.:
210423.57
Organism:
Gallus gallus (chicken)
Description:
Residue:
1906
  
Inhibitor
Name:
BDBM50074651
Synonyms:
CHEMBL262494 | R-K-K-Y-K-G-R-R-K-NH2
Type:
Small organic molecule
Emp. Form.:
C53H99N23O10
Mol. Mass.:
1218.5013
SMILES:
NCCCC[C@H](NC(=O)[C@H](CCCNC(N)=N)NC(=O)[C@H](CCCNC(N)=N)NC(=O)CNC(=O)[C@H](CCCCN)NC(=O)[C@H](Cc1ccc(O)cc1)NC(=O)[C@H](CCCCN)NC(=O)[C@H](CCCCN)NC(=O)[C@@H](N)CCCNC(N)=N)C(N)=O
: