Target
P2Y purinoceptor 1
Ligand
BDBM50076459
Substrate
Meas. Tech.
ChEMBL_147722 (CHEMBL759192)
IC50
4590±n/a nM
Citation
 Nandanan, ECamaioni, EJang, SYKim, YCCristalli, GHerdewijn, PSecrist, JATiwari, KNMohanram, AHarden, TKBoyer, JLJacobson, KA Structure-activity relationships of bisphosphate nucleotide derivatives as P2Y1 receptor antagonists and partial agonists. J Med Chem 42:1625-38 (1999)  
Target
Name:
P2Y purinoceptor 1
Synonyms:
P2RY1 | P2RY1_MELGA
Type:
Mol. Mass.:
41199.64
Organism:
Meleagris gallopavo
Description:
Residue:
362
  
Inhibitor
Name:
BDBM50076459
Synonyms:
CHEMBL43868 | Phosphoric acid mono-[5-(6-amino-2-ethylsulfanyl-purin-9-yl)-2-phosphonooxymethyl-tetrahydro-furan-3-yl] ester
Type:
Small organic molecule
Emp. Form.:
C12H19N5O9P2S
Mol. Mass.:
471.32
SMILES:
CCSc1nc(N)c2ncn(C3CC(OP(O)(O)=O)C(COP(O)(O)=O)O3)c2n1
: