Target
Gag-Pol polyprotein
Ligand
BDBM50065793
Substrate
Meas. Tech.
ChEMBL_88784 (CHEMBL699442)
IC50
2100.00±n/a nM
Citation
 Ouali, MLaboulais, CLeh, HGill, DDesmaële, DMekouar, KZouhiri, Fd'Angelo, JAuclair, CMouscadet, JFLe Bret, M Modeling of the inhibition of retroviral integrases by styrylquinoline derivatives. J Med Chem 43:1949-57 (2000)  
Target
Name:
Gag-Pol polyprotein
Synonyms:
POL_RSVP gag-pol
Type:
PROTEIN
Mol. Mass.:
173907.80
Organism:
Rous sarcoma virus (strain Prague C) (RSV-PrC)
Description:
ChEMBL_88784
Residue:
1603
  
Inhibitor
Name:
BDBM50065793
Synonyms:
8-Hydroxy-2-[(E)-2-(3,4,5-trihydroxy-phenyl)-vinyl]-quinoline-7-carboxylic acid 8-hydroxy-2-(3,4,5-trihydroxystyryl)quinoline-7-carboxylic acid | CHEMBL37869
Type:
Small organic molecule
Emp. Form.:
C18H13NO6
Mol. Mass.:
339.2989
SMILES:
OC(=O)c1ccc2ccc(\C=C\c3cc(O)c(O)c(O)c3)nc2c1O
: