Target
Gag-Pol polyprotein
Ligand
BDBM50065798
Substrate
Meas. Tech.
ChEMBL_88784 (CHEMBL699442)
IC50
>100000.00±n/a nM
Citation
 Ouali, MLaboulais, CLeh, HGill, DDesmaële, DMekouar, KZouhiri, Fd'Angelo, JAuclair, CMouscadet, JFLe Bret, M Modeling of the inhibition of retroviral integrases by styrylquinoline derivatives. J Med Chem 43:1949-57 (2000)  
Target
Name:
Gag-Pol polyprotein
Synonyms:
POL_RSVP gag-pol
Type:
PROTEIN
Mol. Mass.:
173907.80
Organism:
Rous sarcoma virus (strain Prague C) (RSV-PrC)
Description:
ChEMBL_88784
Residue:
1603
  
Inhibitor
Name:
BDBM50065798
Synonyms:
Acetic acid 2-((E)-styryl)-quinolin-8-yl ester CHEMBL293788
Type:
Small organic molecule
Emp. Form.:
C19H15NO2
Mol. Mass.:
289.3279
SMILES:
CC(=O)Oc1cccc2ccc(\C=C\c3ccccc3)nc12
: