Target
Gag-Pol polyprotein
Ligand
BDBM50087435
Substrate
Meas. Tech.
ChEMBL_88784 (CHEMBL699442)
IC50
20900±n/a nM
Citation
 Ouali, MLaboulais, CLeh, HGill, DDesmaële, DMekouar, KZouhiri, Fd'Angelo, JAuclair, CMouscadet, JFLe Bret, M Modeling of the inhibition of retroviral integrases by styrylquinoline derivatives. J Med Chem 43:1949-57 (2000)  
Target
Name:
Gag-Pol polyprotein
Synonyms:
POL_RSVP gag-pol
Type:
PROTEIN
Mol. Mass.:
173907.80
Organism:
Rous sarcoma virus (strain Prague C) (RSV-PrC)
Description:
ChEMBL_88784
Residue:
1603
  
Inhibitor
Name:
BDBM50087435
Synonyms:
(E)-8-hydroxy-2-(4-hydroxystyryl)quinoline-7-carboxylic acid 8-hydroxy-2-(4-hydroxystyryl)quinoline-7-carboxylic acid | CHEMBL418613
Type:
Small organic molecule
Emp. Form.:
C18H13NO4
Mol. Mass.:
307.3001
SMILES:
OC(=O)c1ccc2ccc(\C=C\c3ccc(O)cc3)nc2c1O
: