Target
Adenosine receptor A1
Ligand
BDBM50088425
Substrate
Meas. Tech.
ChEMBL_29487 (CHEMBL641721)
Ki
69±n/a nM
Citation
 Jacobson, KAJi, XLi, AHMelman, NSiddiqui, MAShin, KJMarquez, VERavi, RG Methanocarba analogues of purine nucleosides as potent and selective adenosine receptor agonists. J Med Chem 43:2196-203 (2000)  
Target
Name:
Adenosine receptor A1
Synonyms:
AA1R_RAT ADENOSINE A1 high Adenosine A1 receptor (A1) Adenosine receptors A1 | Adora1
Type:
Protein
Mol. Mass.:
36704.13
Organism:
Rattus norvegicus (rat)
Description:
Residue:
326
  
Inhibitor
Name:
BDBM50088425
Synonyms:
(1R,2R,3S,4R,5S)-1-Hydroxymethyl-4-[6-(3-iodo-benzylamino)-purin-9-yl]-bicyclo[3.1.0]hexane-2,3-diol 1-hydroxymethyl-4-[6-(3-iodobenzylamino)-9H-9-purinyl]-(1R,2R,3S,4R,5S)-bicyclo[3.1.0]hexane-2,3-diol | CHEMBL417292
Type:
Small organic molecule
Emp. Form.:
C19H20IN5O3
Mol. Mass.:
493.2983
SMILES:
OC[C@@]12C[C@@H]1[C@H]([C@H](O)[C@@H]2O)n1cnc2c(NCc3cccc(I)c3)ncnc12
: