Target
Ectonucleoside triphosphate diphosphohydrolase 1
Ligand
BDBM50369524
Substrate
Meas. Tech.
ChEMBL_143948 (CHEMBL751429)
Ki
16000±n/a nM
Citation
 Gendron, FPHalbfinger, EFischer, BDuval, MD'Orléans-Juste, PBeaudoin, AR Novel inhibitors of nucleoside triphosphate diphosphohydrolases: chemical synthesis and biochemical and pharmacological characterizations. J Med Chem 43:2239-47 (2000)  
Target
Name:
Ectonucleoside triphosphate diphosphohydrolase 1
Synonyms:
ATPDase CD_antigen=CD39 ENTPD1 Ecto-apyrase NTPDase 1
Type:
PROTEIN
Mol. Mass.:
58115.72
Organism:
Bos taurus
Description:
ChEMBL_143948
Residue:
513
  
Inhibitor
Name:
BDBM50369524
Synonyms:
CHEMBL607720
Type:
Small organic molecule
Emp. Form.:
C16H28N5O13P3S
Mol. Mass.:
623.406
SMILES:
CCCCCCSc1nc2c(N)ncnc2n1C1O[C@H](COP(O)(=O)OP(O)(=O)OP(O)(O)=O)[C@@H](O)[C@H]1O
: