Target
Cholecystokinin receptor type A
Ligand
BDBM50089270
Substrate
Meas. Tech.
ChEMBL_47646 (CHEMBL657358)
Ki
51±n/a nM
Citation
 Pierson, MEComstock, JMSimmons, RDJulien, RKaiser, FRosamond, JD CCK peptides with combined features of hexa- and tetrapeptide CCK-A agonists. J Med Chem 43:2350-5 (2000)  
Target
Name:
Cholecystokinin receptor type A
Synonyms:
CCKAR_RAT Cholecystokinin peripheral Cholecystokinin receptor type A
Type:
Enzyme Catalytic Domain
Mol. Mass.:
49676.37
Organism:
RAT
Description:
Cholecystokinin central 0 RAT::P30551
Residue:
444
  
Inhibitor
Name:
BDBM50089270
Synonyms:
CHEMBL308622 | N-(1-Carbamoyl-2-phenyl-ethyl)-3-{2-[2-(2-{2-[2-(4-hydroxy-phenyl)-acetylamino]-hexanoylamino}-acetylamino)-3-(1H-indol-3-yl)-propionylamino]-hexanoylamino}-N-methyl-succinamic acid
Type:
Small organic molecule
Emp. Form.:
C47H60N8O10
Mol. Mass.:
897.0269
SMILES:
CCCCC(NC(=O)Cc1ccc(O)cc1)C(=O)NCC(=O)NC(Cc1c[nH]c2ccccc12)C(=O)NC(CCCC)C(=O)NC(CC(O)=O)C(=O)N(C)C(Cc1ccccc1)C(N)=O
: