Target
Similar to alpha-tubulin isoform 1/Tubulin beta-2B chain
Ligand
BDBM50089335
Substrate
Meas. Tech.
ChEMBL_211317 (CHEMBL818977)
IC50
30000±n/a nM
Citation
 Wang, ZYang, DMohanakrishnan, AKFanwick, PENampoothiri, PHamel, ECushman, M Synthesis of B-ring homologated estradiol analogues that modulate tubulin polymerization and microtubule stability. J Med Chem 43:2419-29 (2000)  
Target
Name:
Similar to alpha-tubulin isoform 1/Tubulin beta-2B chain
Synonyms:
Tubulin | Tubulin alpha chain /beta chain
Type:
Mol. Mass.:
Description:
ASSAY_ID of EBI is 51441
Components:
This complex has 2 components.
Component 1
Name:
Tubulin beta-2B chain
Synonyms:
TBB2B_BOVIN Tubulin | Tubulin beta chain
Type:
PROTEIN
Mol. Mass.:
49932.38
Organism:
Bos taurus
Description:
ChEMBL_211651
Residue:
445
  
Component 2
Name:
Similar to alpha-tubulin isoform 1
Synonyms:
Tubulin
Type:
PROTEIN
Mol. Mass.:
9422.48
Organism:
Bos taurus
Description:
EBI_18002
Residue:
84
  
Inhibitor
Name:
BDBM50089335
Synonyms:
9-Ethoxy-1,8-dihydroxy-12a-methyl-2,3,3a,3b,4,5,10b,11,12,12a-decahydro-1H-benzo[3,4]cyclohepta[1,2-e]inden-6-one O-methyl-oxime | CHEMBL302676
Type:
Small organic molecule
Emp. Form.:
C22H31NO4
Mol. Mass.:
373.4858
SMILES:
CCOc1cc2C3CC[C@]4(C)[C@@H](O)CCC4C3CC\C(=N/OC)c2cc1O
: