Target
cGMP-specific 3',5'-cyclic phosphodiesterase
Ligand
BDBM50089814
Substrate
Meas. Tech.
ChEMBL_155360 (CHEMBL762505)
IC50
0.56±n/a nM
Citation
 Watanabe, NAdachi, HTakase, YOzaki, HMatsukura, MMiyazaki, KIshibashi, KIshihara, HKodama, KNishino, MKakiki, MKabasawa, Y 4-(3-Chloro-4-methoxybenzyl)aminophthalazines: synthesis and inhibitory activity toward phosphodiesterase 5. J Med Chem 43:2523-9 (2000)  
Target
Name:
cGMP-specific 3',5'-cyclic phosphodiesterase
Synonyms:
3',5'-cyclic phosphodiesterase PDE5 PDE5A_HUMAN Phosphodiesterase 5 (PDE5) Phosphodiesterase 5A (PDE5A) cGMP-specific 3',5'-cyclic phosphodiesterase
Type:
Protein
Mol. Mass.:
99975.83
Organism:
Homo sapiens (Human)
Description:
O76074
Residue:
875
  
Inhibitor
Name:
BDBM50089814
Synonyms:
4-(3-Chloro-4-methoxy-benzylamino)-1-(4-hydroxy-piperidin-1-yl)-phthalazine-6-carbonitrile; hydrochloride CHEMBL545712
Type:
Small organic molecule
Emp. Form.:
C22H22ClN5O2
Mol. Mass.:
423.895
SMILES:
COc1ccc(CNc2nnc(N3CCC(O)CC3)c3ccc(cc23)C#N)cc1Cl
: