Target
cGMP-specific 3',5'-cyclic phosphodiesterase
Ligand
BDBM50089819
Substrate
Meas. Tech.
ChEMBL_155357 (CHEMBL762502)
IC50
14±n/a nM
Citation
 Watanabe, NAdachi, HTakase, YOzaki, HMatsukura, MMiyazaki, KIshibashi, KIshihara, HKodama, KNishino, MKakiki, MKabasawa, Y 4-(3-Chloro-4-methoxybenzyl)aminophthalazines: synthesis and inhibitory activity toward phosphodiesterase 5. J Med Chem 43:2523-9 (2000)  
Target
Name:
cGMP-specific 3',5'-cyclic phosphodiesterase
Synonyms:
3',5'-cyclic phosphodiesterase PDE5 PDE5A_HUMAN Phosphodiesterase 5 (PDE5) Phosphodiesterase 5A (PDE5A) cGMP-specific 3',5'-cyclic phosphodiesterase
Type:
Protein
Mol. Mass.:
99975.83
Organism:
Homo sapiens (Human)
Description:
O76074
Residue:
875
  
Inhibitor
Name:
BDBM50089819
Synonyms:
CHEMBL544540 | N-{1-[4-(3-Chloro-4-methoxy-benzylamino)-6-cyano-phthalazin-1-yl]-piperidin-4-yl}-methanesulfonamide; hydrochloride
Type:
Small organic molecule
Emp. Form.:
C23H25ClN6O3S
Mol. Mass.:
501.001
SMILES:
COc1ccc(CNc2nnc(N3CCC(CC3)NS(C)(=O)=O)c3ccc(cc23)C#N)cc1Cl
: