Target
cGMP-specific 3',5'-cyclic phosphodiesterase
Ligand
BDBM50089837
Substrate
Meas. Tech.
ChEMBL_155357 (CHEMBL762502)
IC50
0.32±n/a nM
Citation
 Watanabe, NAdachi, HTakase, YOzaki, HMatsukura, MMiyazaki, KIshibashi, KIshihara, HKodama, KNishino, MKakiki, MKabasawa, Y 4-(3-Chloro-4-methoxybenzyl)aminophthalazines: synthesis and inhibitory activity toward phosphodiesterase 5. J Med Chem 43:2523-9 (2000)  
Target
Name:
cGMP-specific 3',5'-cyclic phosphodiesterase
Synonyms:
3',5'-cyclic phosphodiesterase PDE5 PDE5A_HUMAN Phosphodiesterase 5 (PDE5) Phosphodiesterase 5A (PDE5A) cGMP-specific 3',5'-cyclic phosphodiesterase
Type:
Protein
Mol. Mass.:
99975.83
Organism:
Homo sapiens (Human)
Description:
O76074
Residue:
875
  
Inhibitor
Name:
BDBM50089837
Synonyms:
4-(3-Chloro-4-methoxy-benzylamino)-1-thiomorpholin-4-yl-phthalazine-6-carbonitrile; hydrochloride | CHEMBL545472
Type:
Small organic molecule
Emp. Form.:
C21H20ClN5OS
Mol. Mass.:
425.934
SMILES:
COc1ccc(CNc2nnc(N3CCSCC3)c3ccc(cc23)C#N)cc1Cl
: