Target
Metabotropic glutamate receptor 2
Ligand
BDBM50089897
Substrate
Meas. Tech.
ChEMBL_106049 (CHEMBL718215)
Ki
3.9±n/a nM
Citation
 Bräuner-Osborne, HEgebjerg, JNielsen, EOMadsen, UKrogsgaard-Larsen, P Ligands for glutamate receptors: design and therapeutic prospects. J Med Chem 43:2609-45 (2000)  
Target
Name:
Metabotropic glutamate receptor 2
Synonyms:
GPRC1B GRM2_HUMAN Metabotropic glutamate receptor mGlu2 | metabotropic glutamate 2
Type:
Enzyme
Mol. Mass.:
95584.88
Organism:
Homo sapiens (Human)
Description:
Q14416
Residue:
872
  
Inhibitor
Name:
BDBM50089897
Synonyms:
4-Amino-2-thia-bicyclo[3.1.0]hexane-4,6-dicarboxylic acid(LY389795) | CHEMBL88999
Type:
Small organic molecule
Emp. Form.:
C7H9NO4S
Mol. Mass.:
203.216
SMILES:
N[C@]1(CSC2[C@@H](C12)C(O)=O)C(O)=O
: