Target
Metabotropic glutamate receptor 7
Ligand
BDBM50004881
Substrate
Meas. Tech.
ChEMBL_104479 (CHEMBL712461)
Ki
185000±n/a nM
Citation
 Bräuner-Osborne, HEgebjerg, JNielsen, EOMadsen, UKrogsgaard-Larsen, P Ligands for glutamate receptors: design and therapeutic prospects. J Med Chem 43:2609-45 (2000)  
Target
Name:
Metabotropic glutamate receptor 7
Synonyms:
GPRC1G GRM7 protein MGLUR7 metabotropic glutamate 7
Type:
Enzyme Catalytic Domain
Mol. Mass.:
102262.98
Organism:
Homo sapiens (Human)
Description:
Q14831
Residue:
915
  
Inhibitor
Name:
BDBM50004881
Synonyms:
(RS) PPG Amino-(4-phosphono-phenyl)-acetic acid(RS-PPG) PPG
Type:
Small organic molecule
Emp. Form.:
C8H10NO5P
Mol. Mass.:
231.1425
SMILES:
NC(C(O)=O)c1ccc(cc1)P(O)(O)=O
: