Target
Metabotropic glutamate receptor 4
Ligand
BDBM86213
Substrate
Meas. Tech.
ChEMBL_106560 (CHEMBL716502)
Ki
>100000±n/a nM
Citation
 Bräuner-Osborne, HEgebjerg, JNielsen, EOMadsen, UKrogsgaard-Larsen, P Ligands for glutamate receptors: design and therapeutic prospects. J Med Chem 43:2609-45 (2000)  
Target
Name:
Metabotropic glutamate receptor 4
Synonyms:
GPRC1D GRM4_HUMAN MGLUR4 Metabotropic glutamate receptor 4 (mGlu4) metabotropic glutamate 4
Type:
Protein
Mol. Mass.:
101899.95
Organism:
Homo sapiens (Human)
Description:
Q14833
Residue:
912
  
Inhibitor
Name:
BDBM86213
Synonyms:
CAS_5126051 CPCCOEt | NSC_5126051
Type:
Small organic molecule
Emp. Form.:
C13H13NO4
Mol. Mass.:
247.2466
SMILES:
CCOC(=O)C12CC1C(N=O)c1ccccc1O2
: