Target
Metabotropic glutamate receptor 7
Ligand
BDBM50056272
Substrate
Meas. Tech.
ChEMBL_104479 (CHEMBL712461)
Ki
>100000±n/a nM
Citation
 Bräuner-Osborne, HEgebjerg, JNielsen, EOMadsen, UKrogsgaard-Larsen, P Ligands for glutamate receptors: design and therapeutic prospects. J Med Chem 43:2609-45 (2000)  
Target
Name:
Metabotropic glutamate receptor 7
Synonyms:
GPRC1G GRM7 protein MGLUR7 metabotropic glutamate 7
Type:
Enzyme Catalytic Domain
Mol. Mass.:
102262.98
Organism:
Homo sapiens (Human)
Description:
Q14831
Residue:
915
  
Inhibitor
Name:
BDBM50056272
Synonyms:
(1S,2S,5R,6S)-2-Amino-bicyclo[3.1.0]hexane-2,6-dicarboxylic acid (2S,6S)-2-Amino-bicyclo[3.1.0]hexane-2,6-dicarboxylic acid 2-Amino-bicyclo[3.1.0]hexane-2,6-dicarboxylic acid (LY 354740) CHEMBL8759 LY366563
Type:
Small organic molecule
Emp. Form.:
C8H11NO4
Mol. Mass.:
185.1772
SMILES:
N[C@]1(CC[C@H]2[C@@H]([C@@H]12)C(O)=O)C(O)=O
: