Target
Glutathione reductase, mitochondrial
Ligand
BDBM50091152
Substrate
Meas. Tech.
ChEMBL_72595 (CHEMBL681183)
Ki
2000000±n/a nM
Citation
 Khan, MOAustin, SEChan, CYin, HMarks, DVaghjiani, SNKendrick, HYardley, VCroft, SLDouglas, KT Use of an additional hydrophobic binding site, the Z site, in the rational drug design of a new class of stronger trypanothione reductase inhibitor, quaternary alkylammonium phenothiazines. J Med Chem 43:3148-56 (2000)  
Target
Name:
Glutathione reductase, mitochondrial
Synonyms:
GLUR GSHR_HUMAN Glutathione reductase | Glutathione reductase (GR)
Type:
Enzyme
Mol. Mass.:
56271.52
Organism:
Homo sapiens (Human)
Description:
P00390
Residue:
522
  
Inhibitor
Name:
BDBM50091152
Synonyms:
CHEMBL106108 | [3-(2-Chloro-phenothiazin-10-yl)-propyl]-cyclohexylmethyl-dimethyl-ammonium (OFK003)
Type:
Small organic molecule
Emp. Form.:
C24H32ClN2S
Mol. Mass.:
416.042
SMILES:
C[N+](C)(CCCN1c2ccccc2Sc2ccc(Cl)cc12)CC1CCCCC1
: