Target
Integrin alpha-IIb/beta-3
Ligand
BDBM50092128
Substrate
Meas. Tech.
ChEMBL_222945 (CHEMBL845764)
IC50
22±n/a nM
Citation
 Scarborough, RMGretler, DD Platelet glycoprotein IIb-IIIa antagonists as prototypical integrin blockers: novel parenteral and potential oral antithrombotic agents. J Med Chem 43:3453-73 (2000)  
Target
Name:
Integrin alpha-IIb/beta-3
Synonyms:
Glycoprotein IIb/IIIa
Type:
Mol. Mass.:
Description:
ASSAY_ID of EBI is 30109
Components:
This complex has 2 components.
Component 1
Name:
Integrin beta-3
Synonyms:
CD_antigen=CD61 GPIIIa ITGB3 Platelet membrane glycoprotein IIIa
Type:
Protein
Mol. Mass.:
87038.91
Organism:
Homo sapiens (Human)
Description:
P05106
Residue:
788
  
Component 2
Name:
Integrin alpha-IIb
Synonyms:
CD_antigen=CD41 GPIIb Glycoprotein IIb ITGA2B Integrin alpha-IIb heavy chain Integrin alpha-IIb light chain, form 2 Integrin alpha-V/beta-3 and alpha-IIb/beta 3 | Platelet membrane glycoprotein IIb
Type:
Protein
Mol. Mass.:
113354.85
Organism:
Homo sapiens (Human)
Description:
P08514
Residue:
1039
  
Inhibitor
Name:
BDBM50092128
Synonyms:
3-[(2-{4-[(1,4-Dioxa-8-aza-spiro[4.5]dec-8-yl)-imino-methyl]-benzoylimino}-3,4-dimethyl-2,3-dihydro-thiazole-5-carbonyl)-amino]-propionic acid (PSA0613) | CHEMBL333947
Type:
Small organic molecule
Emp. Form.:
C24H29N5O6S
Mol. Mass.:
515.582
SMILES:
Cc1c(s\c(=N/C(=O)c2ccc(cc2)C(=N)N2CCC3(CC2)OCCO3)n1C)C(=O)NCCC(O)=O
: