Target
Integrin alpha-IIb/beta-3
Ligand
BDBM50054538
Substrate
Meas. Tech.
ChEMBL_219258 (CHEMBL881612)
IC50
12±n/a nM
Citation
 Scarborough, RMGretler, DD Platelet glycoprotein IIb-IIIa antagonists as prototypical integrin blockers: novel parenteral and potential oral antithrombotic agents. J Med Chem 43:3453-73 (2000)  
Target
Name:
Integrin alpha-IIb/beta-3
Synonyms:
Glycoprotein IIb/IIIa
Type:
Mol. Mass.:
Description:
ASSAY_ID of EBI is 30109
Components:
This complex has 2 components.
Component 1
Name:
Integrin beta-3
Synonyms:
CD_antigen=CD61 GPIIIa ITGB3 Platelet membrane glycoprotein IIIa
Type:
Protein
Mol. Mass.:
87038.91
Organism:
Homo sapiens (Human)
Description:
P05106
Residue:
788
  
Component 2
Name:
Integrin alpha-IIb
Synonyms:
CD_antigen=CD41 GPIIb Glycoprotein IIb ITGA2B Integrin alpha-IIb heavy chain Integrin alpha-IIb light chain, form 2 Integrin alpha-V/beta-3 and alpha-IIb/beta 3 | Platelet membrane glycoprotein IIb
Type:
Protein
Mol. Mass.:
113354.85
Organism:
Homo sapiens (Human)
Description:
P08514
Residue:
1039
  
Inhibitor
Name:
BDBM50054538
Synonyms:
(S)-3-[2-(1-Oxo-7-piperazin-1-yl-3,4-dihydro-1H-isoquinolin-2-yl)-acetylamino]-pent-4-ynoic acid CHEMBL57886 | L-767679
Type:
Small organic molecule
Emp. Form.:
C20H24N4O4
Mol. Mass.:
384.429
SMILES:
OC(=O)C[C@H](NC(=O)CN1CCc2ccc(cc2C1=O)N1CCNCC1)C#C
: