Target
Gastrin/cholecystokinin type B receptor
Ligand
BDBM81962
Substrate
Meas. Tech.
ChEMBL_48262 (CHEMBL662290)
IC50
2±n/a nM
Citation
 Low, CMBlack, JWBroughton, HBBuck, IMDavies, JMDunstone, DJHull, RAKalindjian, SBMcDonald, IMPether, MJShankley, NPSteel, KI Development of peptide 3D structure mimetics: rational design of novel peptoid cholecystokinin receptor antagonists. J Med Chem 43:3505-17 (2000)  
Target
Name:
Gastrin/cholecystokinin type B receptor
Synonyms:
Cckbr Cholecystokinin receptor Gastrin/cholecystokinin type B receptor
Type:
Enzyme Catalytic Domain
Mol. Mass.:
49196.59
Organism:
MOUSE
Description:
Cholecystokinin A CCKBR MOUSE::P56481
Residue:
453
  
Inhibitor
Name:
BDBM81962
Synonyms:
S-L-365,260
Type:
Emp. Form.:
C24H22N4O2
Mol. Mass.:
398.4571
SMILES:
CN1c2ccccc2C(=N[C@@H](NC(=O)Nc2cccc(C)c2)C1=O)c1ccccc1
: