Target
Collagenase 3
Ligand
BDBM12075
Substrate
Meas. Tech.
ChEMBL_106476 (CHEMBL719145)
IC50
8±n/a nM
Citation
 O'Brien, PMOrtwine, DFPavlovsky, AGPicard, JASliskovic, DRRoth, BDDyer, RDJohnson, LLMan, CFHallak, H Structure-activity relationships and pharmacokinetic analysis for a series of potent, systemically available biphenylsulfonamide matrix metalloproteinase inhibitors. J Med Chem 43:156-66 (2000)  
Target
Name:
Collagenase 3
Synonyms:
MMP-13 MMP13_HUMAN Matrix metalloproteinase-13 (MMP-13) | Matrix metalloproteinase-13 (MMP13)
Type:
Enzyme
Mol. Mass.:
53808.06
Organism:
Homo sapiens (Human)
Description:
P45452
Residue:
471
  
Inhibitor
Name:
BDBM12075
Synonyms:
(2S)-2-{[4-(4-bromophenyl)benzene]sulfonamido}-3-methylbutanoic acid alpha-arylsulfonylamino carboxylate 2S
Type:
Small organic molecule
Emp. Form.:
C17H18BrNO4S
Mol. Mass.:
412.298
SMILES:
CC(C)[C@H](NS(=O)(=O)c1ccc(cc1)-c1ccc(Br)cc1)C(O)=O
: