Target
Stromelysin-1
Ligand
BDBM50084285
Substrate
Meas. Tech.
ChEMBL_104706 (CHEMBL709520)
IC50
12±n/a nM
Citation
 O'Brien, PMOrtwine, DFPavlovsky, AGPicard, JASliskovic, DRRoth, BDDyer, RDJohnson, LLMan, CFHallak, H Structure-activity relationships and pharmacokinetic analysis for a series of potent, systemically available biphenylsulfonamide matrix metalloproteinase inhibitors. J Med Chem 43:156-66 (2000)  
Target
Name:
Stromelysin-1
Synonyms:
MMP-3 MMP3_HUMAN Matrix metalloproteinase 3 Matrix metalloproteinase-3 (MMP-3) SL-1 Stromelysin 1 | Transin-1
Type:
Enzyme
Mol. Mass.:
53973.13
Organism:
Homo sapiens (Human)
Description:
P08254
Residue:
477
  
Inhibitor
Name:
BDBM50084285
Synonyms:
2-(4'-Bromo-biphenyl-4-sulfonylamino)-propionic acid | CHEMBL432307
Type:
Small organic molecule
Emp. Form.:
C15H14BrNO4S
Mol. Mass.:
384.245
SMILES:
C[C@H](NS(=O)(=O)c1ccc(cc1)-c1ccc(Br)cc1)C(O)=O
: