Target
Glutamate receptor 4
Ligand
BDBM50094016
Substrate
Meas. Tech.
ChEMBL_220568 (CHEMBL841849)
EC50
270±n/a nM
Citation
 Ornstein, PLZimmerman, DMArnold, MBBleisch, TJCantrell, BSimon, RZarrinmayeh, HBaker, SRGates, MTizzano, JPBleakman, DMandelzys, AJarvie, KRHo, KDeverill, MKamboj, RK Biarylpropylsulfonamides as novel, potent potentiators of 2-amino-3- (5-methyl-3-hydroxyisoxazol-4-yl)- propanoic acid (AMPA) receptors. J Med Chem 43:4354-8 (2000)  
Target
Name:
Glutamate receptor 4
Synonyms:
GLUR4 GRIA4_HUMAN Glutamate receptor ionotropic AMPA | Glutamate receptor ionotropic, AMPA 4
Type:
PROTEIN
Mol. Mass.:
100881.87
Organism:
Homo sapiens (Human)
Description:
ChEMBL_468628
Residue:
902
  
Inhibitor
Name:
BDBM50094016
Synonyms:
CHEMBL343571 | Propane-2-sulfonic acid [2-(4'-methyl-biphenyl-4-yl)-propyl]-amide
Type:
Small organic molecule
Emp. Form.:
C19H25NO2S
Mol. Mass.:
331.472
SMILES:
CC(C)S(=O)(=O)NCC(C)c1ccc(cc1)-c1ccc(C)cc1
: