Target
Androgen receptor
Ligand
BDBM50094579
Substrate
Meas. Tech.
ChEMBL_36309 (CHEMBL883286)
IC50
9730±n/a nM
Citation
 Burden, PMAi, THLin, HQAkinci, MCostandi, MHambley, TMJohnston, GA Chiral derivatives of 2-cyclohexylideneperhydro-4,7-methanoindenes, a novel class of nonsteroidal androgen receptor ligand: synthesis, X-ray analysis, and biological activity. J Med Chem 43:4629-35 (2001)  
Target
Name:
Androgen receptor
Synonyms:
ANDR_RAT Ar Nr3c4 | androgen
Type:
Enzyme
Mol. Mass.:
98219.08
Organism:
Rattus norvegicus (Rat)
Description:
P15207
Residue:
902
  
Inhibitor
Name:
BDBM50094579
Synonyms:
(3aS)-4-(5-Hydroxy-5-vinyl-octahydro-4,7-methano-inden-2-ylidene)-cyclohexanone | CHEMBL358058
Type:
Small organic molecule
Emp. Form.:
C18H24O2
Mol. Mass.:
272.382
SMILES:
[#8][C@]1([#6]-[#6@@H]-2-[#6]-[#6@H]1-[#6@H]-1-[#6]\[#6](-[#6]-[#6@@H]-2-1)=[#6]-1\[#6]-[#6]-[#6](=O)-[#6]-[#6]-1)[#6]=[#6]
: