Target
Adenosine deaminase
Ligand
BDBM50070641
Substrate
Meas. Tech.
ChEMBL_30800 (CHEMBL645076)
Ki
0.51±n/a nM
Citation
 Pragnacharyulu, PVVarkhedkar, VCurtis, MAChang, IFAbushanab, E Adenosine deaminase inhibitors: synthesis and biological evaluation of unsaturated, aromatic, and oxo derivatives of (+)-erythro-9-(2'S-hydroxy-3'R-nonyl)adenine [(+)-EHNA]. J Med Chem 43:4694-700 (2001)  
Target
Name:
Adenosine deaminase
Synonyms:
ADA Adenosine aminohydrolase
Type:
Enzyme
Mol. Mass.:
40910.44
Organism:
Bos taurus (bovine)
Description:
Residue:
363
  
Inhibitor
Name:
BDBM50070641
Synonyms:
(2S,3R)-3-(6-Amino-purin-9-yl)-6-o-tolyl-hexan-2-ol CHEMBL42063
Type:
Small organic molecule
Emp. Form.:
C18H23N5O
Mol. Mass.:
325.4081
SMILES:
C[C@H](O)[C@@H](CCCc1ccccc1C)n1cnc2c(N)ncnc12
: