Target
Acyl carrier protein,/NADH dehydrogenase [ubiquinone] flavoprotein 1, mitochondrial
Ligand
BDBM50369751
Substrate
Meas. Tech.
ChEMBL_141740 (CHEMBL749252)
IC50
0.410000±n/a nM
Citation
 Gallardo, TZafra-Polo, MCTormo, JRGonzález, MCFranck, XEstornell, ECortes, D Semisynthesis of antitumoral acetogenins: SAR of functionalized alkyl-chain bis-tetrahydrofuranic acetogenins, specific inhibitors of mitochondrial complex I. J Med Chem 43:4793-800 (2000)  
Target
Name:
Acyl carrier protein,/NADH dehydrogenase [ubiquinone] flavoprotein 1, mitochondrial
Synonyms:
Mitochondrial complex I; NADH oxidoreductase
Type:
Mol. Mass.:
Description:
ASSAY_ID of EBI is 141738
Components:
This complex has 2 components.
Component 1
Name:
NADH dehydrogenase [ubiquinone] flavoprotein 1, mitochondrial
Synonyms:
CI-51kD NADH dehydrogenase flavoprotein 1 NDUFV1 UQOR1
Type:
PROTEIN
Mol. Mass.:
50659.85
Organism:
Bos taurus
Description:
EBI_100771
Residue:
464
  
Component 2
Name:
Acyl carrier protein, mitochondrial
Synonyms:
ACP CI-SDAP NDUFAB1
Type:
PROTEIN
Mol. Mass.:
17397.64
Organism:
Bos taurus
Description:
ChEMBL_469770
Residue:
156
  
Inhibitor
Name:
BDBM50369751
Synonyms:
MOTRILIN
Type:
Small organic molecule
Emp. Form.:
C37H66O7
Mol. Mass.:
622.9157
SMILES:
CCCCC[C@H](O)CCCC[C@H](O)[C@H]1CC[C@@H](O1)[C@H]1CC[C@@H](O1)[C@H](O)CCCCCCCCCCCCC1=C[C@H](C)OC1=O
: