Target
Sodium-dependent serotonin transporter
Ligand
BDBM50095618
Substrate
Meas. Tech.
ChEMBL_198188 (CHEMBL799116)
Ki
5±n/a nM
Citation
 Froimowitz, MWu, KMMoussa, AHaidar, RMJurayj, JGeorge, CGardner, EL Slow-onset, long-duration 3-(3',4'-dichlorophenyl)-1-indanamine monoamine reuptake blockers as potential medications to treat cocaine abuse. J Med Chem 43:4981-92 (2001)  
Target
Name:
Sodium-dependent serotonin transporter
Synonyms:
5-HT Transporter 5HTT SC6A4_HUMAN SLC6A4 Serotonin transporter (5HTT) Sodium-dependent serotonin transporter (SERT) | Solute carrier family 6 member 4
Type:
Multi-pass membrane protein
Mol. Mass.:
70322.51
Organism:
Homo sapiens (Human)
Description:
P31645
Residue:
630
  
Inhibitor
Name:
BDBM50095618
Synonyms:
CHEMBL341898 [3-(3,4-Dichloro-phenyl)-indan-1-yl]-methyl-amine;chloride
Type:
Small organic molecule
Emp. Form.:
C16H15Cl2N
Mol. Mass.:
292.203
SMILES:
CN[C@@H]1C[C@H](c2ccccc12)c1ccc(Cl)c(Cl)c1
: