Target
Melanocortin receptor 3
Ligand
BDBM50017181
Substrate
Meas. Tech.
ChEMBL_105999 (CHEMBL884507)
EC50
0.240000±n/a nM
Citation
 Grieco, PBalse, PMWeinberg, DMacNeil, THruby, VJ D-Amino acid scan of gamma-melanocyte-stimulating hormone: importance of Trp(8) on human MC3 receptor selectivity. J Med Chem 43:4998-5002 (2001)  
Target
Name:
Melanocortin receptor 3
Synonyms:
MC3-R MC3R_HUMAN Melanocortin receptor (M3 and M4)
Type:
Enzyme
Mol. Mass.:
36044.86
Organism:
Homo sapiens (Human)
Description:
P41968
Residue:
323
  
Inhibitor
Name:
BDBM50017181
Synonyms:
CHEMBL441738
Type:
Small organic molecule
Emp. Form.:
C78H111N21O19
Mol. Mass.:
1646.8452
SMILES:
CCCC[C@H](NC(=O)[C@H](CO)NC(=O)[C@H](Cc1ccc(O)cc1)NC(=O)[C@H](CO)NC(C)=O)C(=O)N[C@@H](CCC(O)=O)C(=O)N[C@@H](Cc1cnc[nH]1)C(=O)N[C@H](Cc1ccccc1)C(=O)N[C@@H](CCCNC(N)=N)C(=O)N[C@@H](Cc1c[nH]c2ccccc12)C(=O)NCC(=O)N[C@@H](CCCCN)C(=O)N1CCC[C@H]1C(=O)N[C@@H](C(C)C)C(N)=O
: