Target
Coagulation factor X
Ligand
BDBM50084617
Substrate
Meas. Tech.
ChEMBL_48989 (CHEMBL662872)
Ki
1.3±n/a nM
Citation
 Leung, DAbbenante, GFairlie, DP Protease inhibitors: current status and future prospects. J Med Chem 43:305-41 (2000)  
Target
Name:
Coagulation factor X
Synonyms:
Activated coagulation factor X (FXa) Coagulation factor X precursor F10 Factor X heavy chain Factor Xa Stuart-Prower factor
Type:
Enzyme
Mol. Mass.:
54726.60
Organism:
Homo sapiens (Human)
Description:
Residue:
488
  
Inhibitor
Name:
BDBM50084617
Synonyms:
((7-carbamimidoyl-naphthalen-2-ylmethyl)-{4-[1-(1-imino-ethyl)-piperidin-4-yloxy]-phenyl}-sulfamoyl)-acetic acid YM-60828
Type:
Small organic molecule
Emp. Form.:
C27H31N5O5S
Mol. Mass.:
537.631
SMILES:
CC(=N)N1CCC(CC1)Oc1ccc(cc1)N(Cc1ccc2ccc(cc2c1)C(N)=N)S(=O)(=O)CC(O)=O
: