Target
Prothrombin
Ligand
BDBM17283
Substrate
Meas. Tech.
ChEMBL_208886 (CHEMBL814943)
Ki
>2000000±n/a nM
Citation
 Leung, DAbbenante, GFairlie, DP Protease inhibitors: current status and future prospects. J Med Chem 43:305-41 (2000)  
Target
Name:
Prothrombin
Synonyms:
Activation peptide fragment 1 Coagulation factor II Prothrombin precursor Thrombin heavy chain | Thrombin light chain
Type:
Protein
Mol. Mass.:
70029.57
Organism:
Homo sapiens (Human)
Description:
P00734
Residue:
622
  
Inhibitor
Name:
BDBM17283
Synonyms:
(2S)-3-(7-carbamimidoylnaphthalen-2-yl)-2-(4-{[(3S)-1-ethanimidoylpyrrolidin-3-yl]oxy}phenyl)propanoic acid DX-9065a
Type:
Small organic molecule
Emp. Form.:
C26H28N4O3
Mol. Mass.:
444.5255
SMILES:
CC(=N)N1CC[C@@H](C1)Oc1ccc(cc1)[C@H](Cc1ccc2ccc(cc2c1)C(N)=N)C(O)=O
: