Target
Angiotensin-converting enzyme
Ligand
BDBM50369775
Substrate
Meas. Tech.
ChEMBL_36899 (CHEMBL648689)
IC50
0.930±n/a nM
Citation
 Leung, DAbbenante, GFairlie, DP Protease inhibitors: current status and future prospects. J Med Chem 43:305-41 (2000)  
Target
Name:
Angiotensin-converting enzyme
Synonyms:
ACE Angiotensin converting enzyme (ACE) Angiotensin-converting enzyme, soluble form CD_antigen=CD143 DCP1 Kininase II
Type:
Enzyme
Mol. Mass.:
149709.01
Organism:
Homo sapiens (Human)
Description:
Residue:
1306
  
Inhibitor
Name:
BDBM50369775
Synonyms:
Mavik TRANDOLAPRIL
Type:
Small organic molecule
Emp. Form.:
C24H34N2O5
Mol. Mass.:
430.5372
SMILES:
CCOC(=O)[C@H](CCc1ccccc1)N[C@@H](C)C(=O)N1[C@H]2CCCC[C@@H]2C[C@H]1C(O)=O
: