Target
Calpain-2 catalytic subunit
Ligand
BDBM50084650
Substrate
Meas. Tech.
ChEMBL_43859 (CHEMBL658520)
IC50
184±n/a nM
Citation
 Leung, DAbbenante, GFairlie, DP Protease inhibitors: current status and future prospects. J Med Chem 43:305-41 (2000)  
Target
Name:
Calpain-2 catalytic subunit
Synonyms:
CAN2_HUMAN CANPL2 Calcium-activated neutral proteinase 2 Calpain M-type Calpain-2 (m-Calpain) Calpain-2 large subunit M-calpain calpain
Type:
Protein
Mol. Mass.:
79965.18
Organism:
Homo sapiens (Human)
Description:
Residue:
700
  
Inhibitor
Name:
BDBM50084650
Synonyms:
CHEMBL177914 {1-[1-Formyl-2-(4-hydroxy-phenyl)-ethylcarbamoyl]-2-phenyl-ethyl}-carbamic acid benzyl ester(Cbz-Phe-Tyr-CHO)
Type:
Small organic molecule
Emp. Form.:
C26H26N2O5
Mol. Mass.:
446.495
SMILES:
Oc1ccc(C[C@H](NC(=O)[C@H](Cc2ccccc2)NC(=O)OCc2ccccc2)C=O)cc1
: