Target
Coagulation factor X
Ligand
BDBM50084664
Substrate
Meas. Tech.
ChEMBL_48989 (CHEMBL662872)
Ki
0.1±n/a nM
Citation
 Leung, DAbbenante, GFairlie, DP Protease inhibitors: current status and future prospects. J Med Chem 43:305-41 (2000)  
Target
Name:
Coagulation factor X
Synonyms:
Activated coagulation factor X (FXa) Coagulation factor X precursor F10 Factor X heavy chain Factor Xa Stuart-Prower factor
Type:
Enzyme
Mol. Mass.:
54726.60
Organism:
Homo sapiens (Human)
Description:
Residue:
488
  
Inhibitor
Name:
BDBM50084664
Synonyms:
({3-(5-Carbamimidoyl-2-hydroxy-phenoxy)-2,6-difluoro-5-[3-(1-methyl-4,5-dihydro-1H-imidazol-2-yl)-phenoxy]-phenyl}-methyl-amino)-acetic acid | CHEMBL116341
Type:
Small organic molecule
Emp. Form.:
C26H25F2N5O5
Mol. Mass.:
525.504
SMILES:
CN(CC(O)=O)c1c(F)c(Oc2cccc(c2)C2=NCCN2C)cc(Oc2cc(ccc2O)C(N)=N)c1F
: