Target
Serine protease 1
Ligand
BDBM50369774
Substrate
Meas. Tech.
ChEMBL_213068 (CHEMBL817135)
Ki
290±n/a nM
Citation
 Leung, DAbbenante, GFairlie, DP Protease inhibitors: current status and future prospects. J Med Chem 43:305-41 (2000)  
Target
Name:
Serine protease 1
Synonyms:
Alpha-trypsin chain 1 Beta-trypsin PRSS1 TRP1 TRY1_HUMAN Thrombin & trypsin Trypsin I | Trypsin-1
Type:
Enzyme
Mol. Mass.:
26557.80
Organism:
Homo sapiens (Human)
Description:
P07477
Residue:
247
  
Inhibitor
Name:
BDBM50369774
Synonyms:
SEPIMOSTAT MESYLATE | Sepimostat
Type:
Small organic molecule
Emp. Form.:
C21H19N5O2
Mol. Mass.:
373.4079
SMILES:
NC(=N)c1ccc2cc(OC(=O)c3ccc(NC4=NCCN4)cc3)ccc2c1
: