Target
Neutrophil collagenase
Ligand
BDBM30344
Substrate
Meas. Tech.
ChEMBL_105815 (CHEMBL717815)
Ki
4±n/a nM
Citation
 Leung, DAbbenante, GFairlie, DP Protease inhibitors: current status and future prospects. J Med Chem 43:305-41 (2000)  
Target
Name:
Neutrophil collagenase
Synonyms:
CLG1 MMP8 Matrix metalloproteinase-8 PMNL collagenase | PMNL-CL
Type:
Enzyme
Mol. Mass.:
53413.48
Organism:
Homo sapiens (Human)
Description:
P22894
Residue:
467
  
Inhibitor
Name:
BDBM30344
Synonyms:
Cipemastat | Trocade
Type:
Small organic molecule
Emp. Form.:
C22H36N4O5
Mol. Mass.:
436.545
SMILES:
CN1C(=O)N(C[C@@H]([C@@H](CC2CCCC2)C(=O)N2CCCCC2)C(=O)NO)C(=O)C1(C)C
: