Target
Angiotensin-converting enzyme
Ligand
BDBM50084673
Substrate
Meas. Tech.
ChEMBL_36899 (CHEMBL648689)
IC50
2.6±n/a nM
Citation
 Leung, DAbbenante, GFairlie, DP Protease inhibitors: current status and future prospects. J Med Chem 43:305-41 (2000)  
Target
Name:
Angiotensin-converting enzyme
Synonyms:
ACE Angiotensin converting enzyme (ACE) Angiotensin-converting enzyme, soluble form CD_antigen=CD143 DCP1 Kininase II
Type:
Enzyme
Mol. Mass.:
149709.01
Organism:
Homo sapiens (Human)
Description:
Residue:
1306
  
Inhibitor
Name:
BDBM50084673
Synonyms:
(S)-2-((S)-2-((S)-1-ethoxy-1-oxo-4-phenylbutan-2-ylamino)propanoyl)-6,7-dimethoxy-1,2,3,4-tetrahydroisoquinoline-3-carboxylic acid CHEMBL1165 Uniretic | Univasc
Type:
Small organic molecule
Emp. Form.:
C27H34N2O7
Mol. Mass.:
498.5681
SMILES:
CCOC(=O)[C@H](CCc1ccccc1)N[C@@H](C)C(=O)N1Cc2cc(OC)c(OC)cc2C[C@H]1C(O)=O
: