Target
Calpain-1 catalytic subunit
Ligand
BDBM50084684
Substrate
Meas. Tech.
ChEMBL_217824 (CHEMBL821731)
Ki
41000±n/a nM
Citation
 Leung, DAbbenante, GFairlie, DP Protease inhibitors: current status and future prospects. J Med Chem 43:305-41 (2000)  
Target
Name:
Calpain-1 catalytic subunit
Synonyms:
CAN1_HUMAN CAPN1 Calpain-1 (u-Calpain) Calpain1
Type:
Protein
Mol. Mass.:
81880.51
Organism:
Homo sapiens (Human)
Description:
Residue:
714
  
Inhibitor
Name:
BDBM50084684
Synonyms:
CHEMBL333627 | {3-Methyl-1-[1-(3-morpholin-4-yl-propylaminooxalyl)-propylcarbamoyl]-butyl}-carbamic acid benzyl ester
Type:
Small organic molecule
Emp. Form.:
C26H40N4O6
Mol. Mass.:
504.619
SMILES:
CC[C@H](NC(=O)[C@H](CC(C)C)NC(=O)OCc1ccccc1)C(=O)C(=O)NCCCN1CCOCC1
: