Target
Collagenase 3
Ligand
BDBM50084661
Substrate
Meas. Tech.
ChEMBL_106612 (CHEMBL717449)
Ki
1470±n/a nM
Citation
 Leung, DAbbenante, GFairlie, DP Protease inhibitors: current status and future prospects. J Med Chem 43:305-41 (2000)  
Target
Name:
Collagenase 3
Synonyms:
MMP-13 MMP13_HUMAN Matrix metalloproteinase-13 (MMP-13) | Matrix metalloproteinase-13 (MMP13)
Type:
Enzyme
Mol. Mass.:
53808.06
Organism:
Homo sapiens (Human)
Description:
P45452
Residue:
471
  
Inhibitor
Name:
BDBM50084661
Synonyms:
4-(4'-Chloro-biphenyl-4-yl)-4-oxo-2-phenylsulfanylmethyl-butyric acid(Bay-12-9566) Tanomastat
Type:
Small organic molecule
Emp. Form.:
C23H19ClO3S
Mol. Mass.:
410.913
SMILES:
OC(=O)[C@@H](CSc1ccccc1)CC(=O)c1ccc(cc1)-c1ccc(Cl)cc1
: